{"text_format":"1","workbook":"xlsx","n_sheets":13,"sheets":["Pres & Prop Rev","Rate Design","Appendix F Pg 4","COS","Appendix F Pg 6","ROR","Bill Determ","Rate Spread","Sch 177","Residential Bill","Big Schedules","Rev Runs CY","Block Analysis"],"not_rendered":{"charts":0,"images":0,"macros":1,"external_links":1,"defined_names":18,"comments":5,"pivot_tables":0},"unopened":[],"bounds":{"document_bytes":16777216,"sheet_cells":100000,"rows_first":2000,"rows_last":500,"rows_between":2000,"halvings":0,"cell_chars":16384,"cell_head_chars":4096},"cells_cut":0,"cells_raw":0,"read":"whole","date_system":"1900"}

{"sheet":"Pres & Prop Rev","index":0,"n_rows":225,"n_cols":16,"rows_kept":225,"cut":false,"hidden":false,"merged":[[5,15,10,17]]}
[]
["Effective September 1, 2024"]
[null,null,null,null,null,null,null,"ALERIS","CLEARWATER"]
[null,null," ","GEN SERVICE","LRG GEN SVC","INTERRUPTIBLE","TRANSPORT","TRANSPORT","TRANSPORT"]
[null,null,"TOTAL","SCHEDULE 101","SCH. 111&112","SCH. 131&132","SCHEDULE 146","SCHEDULE 147","SCHEDULE 159",null,null,null,null,null,null,"Print Header for all printed pages on this worksheet:"]
[null,"PRESENT BILL DETERMINANTS",null,null,null,null,null,null,null,null,null,"Calculate all revenue exhibits using  ____ rates:",null,null,null,{"$f":"\"AVISTA UTILITIES\nIDAHO GAS, CASE NO. AVU-G-23-01\nPRO FORMA REVENUE UNDER PRESENT AND PROPOSED \"&N9&\" RATES\n12 MONTHS ENDED JUNE 30, 2022\"","v":"AVISTA UTILITIES\nIDAHO GAS, CASE NO. AVU-G-23-01\nPRO FORMA REVENUE UNDER PRESENT AND PROPOSED BASE TARIFF RATES\n12 MONTHS ENDED JUNE 30, 2022"}]
[null,"THERMS",null,null,null,null,null,null,null,null,"1)","BASE TARIFF"]
[null,"BLOCK 1",null,{"$f":"'Bill Determ'!B8","v":70027024.203949988},{"$f":"'Bill Determ'!B15","v":3283296.1716},{"$f":"'Bill Determ'!B25","v":0.1},{"$f":"'Bill Determ'!B29","v":3922248},{"$f":"'Big Schedules'!N46","v":1314220},{"$f":"'Bill Determ'!B35","v":51912883},null,null,"or",null,1]
[null,"BLOCK 2",null,null,{"$f":"'Bill Determ'!C15","v":8247668.8472199989},null,null,null,null,null,"2)","BILLING",null,{"$f":"CHOOSE(Base1_Billing2,L7,L9)","v":"BASE TARIFF"}]
[null,"BLOCK 3",null,null,{"$f":"'Bill Determ'!D15","v":11206259.59857},{"$f":"'Bill Determ'!D25","v":0},{"$f":"'Bill Determ'!D29","v":0},null,null,null,null,null,null,{"$f":"CHOOSE(Base1_Billing2,\"Base\",\"Billing\")","v":"Base"}]
{"$rows_left_out":216}
{"sheet":"Rate Design","index":1,"n_rows":122,"n_cols":16,"rows_kept":122,"cut":false,"hidden":false,"merged":[]}
["PRESENT RATES",null,null,1,2,3,4,null,null,null,"Tiers - used for bill comparisons"]
[null,null,"TOTAL","SCH. 101","SCH. 111,112","SCH. 131,132","SCH. 146",null,"Range Name",null,"SCH. 101","SCH. 111,112","SCH. 131,132","SCH. 146"]
[null,"Base Tariff Rates"]
[1,"BASIC CHARGE",null,15,null,null,300]
[2,"MONTHLY MINIMUM",null,0,81.739999999999995]
[3,"BLOCK 1 PER THERM",null,33.371000000000002,0,20.379000000000001,12.231999999999999,null,null,null,9999999,200,9999999,9999999]
[4,"BLOCK 2 PER THERM",null,0,32.368000000000002,null,null,null,null,null,9999999,1000,9999999,9999999]
[5,"BLOCK 3 PER THERM",null,0,23.574999999999999,null,null,null,"Rates_Base_Present",null,9999999,10000,9999999,9999999]
[6,"BLOCK 4 PER THERM",null,0,17.763999999999999,null,null,null,null,null,9999999,9999999,9999999,9999999]
[7,"BLOCK 5 PER THERM",null,null,null,null,null,null,null,null,9999999,9999999,9999999,9999999]
{"$rows_left_out":113}
{"sheet":"Appendix F Pg 4","index":2,"n_rows":47,"n_cols":24,"rows_kept":47,"cut":false,"hidden":false,"merged":[[4,0,4,11],[0,21,2,22],[0,0,0,11],[1,0,1,11],[2,0,2,11],[3,0,3,11]]}
["AVISTA UTILITIES",null,null,null,null,null,null,null,null,null,null,null,null,null,null,null,null,null,null,null,null,"This worksheet pulls data from 'Pres & Prop Rev' tab."]
["IDAHO GAS, CASE NO. AVU-G-23-01"]
["PROPOSED INCREASE BY SERVICE SCHEDULE"]
["12 MONTHS ENDED JUNE 30, 2022"]
["(000s of Dollars)"]
[]
["Effective September 1, 2023"]
[null,null,null,"Base Tariff",null,"Base Tariff","Base","Total Billed",null,"Sch 176","Total Billed","Percent ",null,"Percent "]
[null,null,null,"Distribution Revenue","Proposed","Distribution Revenue","Tariff","Revenue","Total ","Tax","Revenue"," Increase on",null," Increase on"]
["Line","Type of","Schedule","Under Present","General","Under Proposed","Percent","at Present","General","Rate","at Proposed","Billed GRC",null,"Billed GRC"]
{"$rows_left_out":38}
{"sheet":"COS","index":3,"n_rows":38,"n_cols":12,"rows_kept":38,"cut":false,"hidden":true,"merged":[[0,0,0,10],[1,0,1,10],[2,0,2,10],[3,0,3,10],[4,0,4,10]]}
["AVISTA UTILITIES",null,null,null,null,null,null,null,null,null,null,"This worksheet pulls data from 'ROR' tab."]
["IDAHO GAS, CASE NO. AVU-G-23-01"]
["PRESENT & PROPOSED RATES OF RETURN BY RATE SCHEDULE"]
["12 MONTHS ENDED JUNE 30, 2022"]
[]
["Not Used"]
[]
[null,null,null,"Present Rates",null,null,"Base",null,"Proposed Rates"]
[null,null,null,"Present","Present",null,"Tariff",null,"Proposed","Proposed"]
["Line","Type of","Sch.","Rate of","Relative ",null,"Proposed ",null,"Rate of","Relative"]
{"$rows_left_out":29}
{"sheet":"Appendix F Pg 6","index":4,"n_rows":42,"n_cols":41,"rows_kept":42,"cut":false,"hidden":false,"merged":[[44,0,45,17],[0,0,0,17],[1,0,1,17],[2,0,2,17],[3,0,3,17],[9,0,9,17],[41,0,42,17]]}
["AVISTA UTILITIES",null,null,null,null,null,null,null,null,null,null,null,null,null,null,null,null,null,null,null,null,"This worksheet uses Base & Billing rates from 'Rate Design' tab."]
["IDAHO GAS, CASE NO. AVU-G-23-01"]
["PRESENT AND PROPOSED RATE COMPONENTS BY SCHEDULE"]
[]
[]
[]
[]
[]
[]
["Effective September 1, 2024"]
{"$rows_left_out":33}
{"sheet":"ROR","index":5,"n_rows":56,"n_cols":16,"rows_kept":56,"cut":false,"hidden":false,"merged":[[0,0,0,6],[1,0,1,6],[2,0,2,6],[3,0,3,6]]}
["AVISTA UTILITIES"]
["IDAHO GAS"]
["PRESENT & PROPOSED RATE OF RETURN BY RATE SCHEDULE"]
["12 MONTHS ENDED June 30, 2022"]
[]
[null,"Not updated for actual Revenue Requirement"]
[null,null,"Total","Sch 101","Sch 111","Sch 131","Sch 146"]
[null,"Total Rate Base",{"$f":"SUM(D8:G8)","v":206556000.00000003},170752986.03739256,33787338.880641066,1.2714039004055849E-2,2015675.0692523723,"from COS",null,null,null,{"$f":"D8/$C$8","v":0.82666679272155019},{"$f":"E8/$C$8","v":0.16357471523771308},{"$f":"F8/$C$8","v":6.1552503941090298E-11},{"$f":"G8/$C$8","v":9.7584919791842018E-3}]
[]
[null,"Revenue From Retail Rates",{"$f":"SUM(D10:G10)","v":47311000},39382000,7428000,0,501000,"From Rate Year 1",null,null,null,{"$f":"D10/$C$10","v":0.83240683984697006},{"$f":"E10/$C$10","v":0.15700365665490054},{"$f":"F10/$C$10","v":0},{"$f":"G10/$C$10","v":1.0589503498129399E-2}]
{"$rows_left_out":47}
{"sheet":"Bill Determ","index":6,"n_rows":75,"n_cols":8,"rows_kept":75,"cut":false,"hidden":false,"merged":[]}
["AVISTA UTILITIES"]
["IDAHO NATURAL GAS"]
["ACTUAL / PRO FORMA BILLING DETERMINANTS BY RATE SCHEDULE"]
["12 MONTHS ENDED JUNE 30, 2022"]
[]
[]
["Schedule 101","Total therms","Total Billings"]
["therms per Revenue Run",{"$f":"'Rev Runs CY'!O20","v":70027024.203949988},{"$f":"'Rev Runs CY'!P6","v":1079689}]
[]
[null,null,null,"1001-10000",null,"Total"]
{"$rows_left_out":66}
{"sheet":"Rate Spread","index":7,"n_rows":41,"n_cols":26,"rows_kept":41,"cut":false,"hidden":false,"merged":[[4,0,4,18],[0,0,0,18],[0,24,2,25],[1,0,1,18],[2,0,2,18],[3,0,3,18]]}
["AVISTA UTILITIES"]
["IDAHO GAS, CASE NO. AVU-G-23-01"]
["PROPOSED INCREASE BY SERVICE SCHEDULE"]
["12 MONTHS ENDED JUNE 30, 2022"]
["(000s of Dollars)"]
[]
["Effective September 1, 2023",null,null,null,null,null,null,null,null,null,null,null,null,null,null,null,"Sch 197",null,"Sch 197"]
[null,null,null,"Base Tariff",null,null,"Settlement","Base Tariff","Base","Total Billed",null,null,"Sch 176","Total Billed","Percent ","Total","Percent ","Total","Percent ","Total Billed","Percent ","Percent "]
[null,null,null,"Distribution Revenue","Proposed","Percentage","Base","Distribution Revenue","Tariff","Revenue","Total ","Sch 176","Tax Credit","Revenue"," Increase on","Sch 197 - 2014"," Increase on","Sch 197 - 2014"," Increase on","Revenue"," Increase","Total Increase"]
["Line","Type of","Schedule","Under Present","General","of ","Rate","Under Proposed","Percent","at Present","General","Tax Credit","Percent","at Proposed","Billed GRC","Earnings/DSM","Billed GRC","Earnings","Billed GRC","at Proposed","on Billed","on Billed"]
{"$rows_left_out":32}
{"sheet":"Sch 177","index":8,"n_rows":21,"n_cols":10,"rows_kept":21,"cut":false,"hidden":true,"merged":[]}
[]
["Schedule 177"]
["Deferred Depreciation Credit Rate"]
[]
[]
[null,null,null,"Base Tariff"]
[null,null,null,"Distribution Revenue","Schedule 177",null,"Schedule 177"]
["Line","Type of","Schedule","Under Present","Tax Credit","Test Year","Rate"]
["No.","Service","Number","Rates (1)","Change","Therms","Per Therm"]
[null,"(a)","(b)","(c)"]
{"$rows_left_out":12}
{"sheet":"Residential Bill","index":9,"n_rows":93,"n_cols":12,"rows_kept":93,"cut":false,"hidden":false,"merged":[]}
[]
["Schedule 101 Bill Impact"]
[]
["Effective September 1, 2024"]
[]
["Schedule 101 Present",null,null,null,null,"Schedule 101 Proposed"]
[null,"Basic Charge","Block 1","Total Bill",null,"Basic Charge","Block 1","Block 2","Total Bill",null,"Bill Impact","% Change"]
[null,{"$f":"'Appendix F Pg 6'!H18","v":15},{"$f":"'Appendix F Pg 6'!H20","v":0.93158000000000019},null,null,{"$f":"'Appendix F Pg 6'!Q18","v":20},{"$f":"'Appendix F Pg 6'!Q20","v":0.85392000000000023},0]
[10,{"$f":"$B$8","v":15},{"$f":"A9*$C$8","v":9.3158000000000012},{"$f":"SUM(B9:C9)","v":24.315800000000003},null,{"$f":"$F$8","v":20},{"$f":"A9*$G$8","v":8.5392000000000028},null,{"$f":"SUM(F9:H9)","v":28.539200000000001},null,{"$f":"I9-D9","v":4.223399999999998},{"$f":"K9/D9","v":0.1736895351993353}]
[{"$f":"A9+10","v":20},{"$f":"$B$8","v":15},18.631600000000002,33.631600000000006,null,{"$f":"$F$8","v":20},17.078400000000006,null,37.078400000000002,null,3.4467999999999961,0.10248694680003317]
{"$rows_left_out":84}
{"sheet":"Big Schedules","index":10,"n_rows":66,"n_cols":27,"rows_kept":66,"cut":false,"hidden":false,"merged":[]}
["Idaho Gas Billing Determinants by Customer",null,null,null,null,null,null,null,null,null,null,null,null,null,null,null,null,null,null,null,"Present",null,null,null,"Proposed"]
[null,null,null,null,null,null,null,null,null,null,null,null,null,null,null,"1st",200,1000,10000,null,null,null,"Total ",null,null,null,"Total "]
["ANNUAL USAGE, Sch 146",null,null,null,null,null,null,null,null,null,null,null,null,"12-mo ended",null,200,1000,10000,99999999,null,"Base","Monthly ","Base ",null,"Base","Monthly ","Base "]
["Idaho","2022-01-01","2022-02-01","2022-03-01","2022-04-01","2022-05-01","2022-06-01","2021-07-01","2021-08-01","2021-09-01","2021-10-01","2021-11-01","2021-12-01","Total",null,"thms/mo","thms/mo","thms/mo","thms/mo",null,"Revenue","Minimum","Revenue",null,"Revenue","Minimum","Revenue"]
["Coeur d'Alene Resort",53429,48105,44290,41615,34989,27448,24055,24251,24978,32221,38100,59166,{"$f":"SUM(B5:M5)","v":452647},null,{"$f":"P$3*12-SUMPRODUCT(--(ABS($B5:$M5)<=P$3),P$3-ABS($B5:$M5))","v":2400},{"$f":"Q$3*12-P5-SUMPRODUCT(--(ABS($B5:$M5)<=Q$3),Q$3-ABS($B5:$M5))","v":9600},{"$f":"R$3*12-SUM($P5:Q5)-SUMPRODUCT(--(ABS($B5:$M5)<=R$3),R$3-ABS($B5:$M5))","v":108000},{"$f":"S$3*12-SUM($P5:R5)-SUMPRODUCT(--(ABS($B5:$M5)<=S$3),S$3-ABS($B5:$M5))","v":332647},null,{"$f":"(12*'Appendix F Pg 6'!$D$37)+(N5*(0.13441-0.00897))","v":60380.039680000002},{"$f":"IF(U5<$V$15,$V$15-U5,0)","v":0},{"$f":"U5+V5","v":60380.039680000002},null,{"$f":"(12*'Appendix F Pg 6'!$R$37)+(N5*'Appendix F Pg 6'!$R$39)","v":58967.781040000002},{"$f":"IF(N5<250000,(250000-N5)*'Appendix F Pg 6'!$R$39,0)","v":0},{"$f":"Y5+Z5","v":58967.781040000002}]
["Idaho Asphalt",37272,47212,83613,116823,138176,124935,114701,111647,91126,92895,85237,48485,1092122,null,{"$f":"P$3*12-SUMPRODUCT(--(ABS($B6:$M6)<=P$3),P$3-ABS($B6:$M6))","v":2400},{"$f":"Q$3*12-P6-SUMPRODUCT(--(ABS($B6:$M6)<=Q$3),Q$3-ABS($B6:$M6))","v":9600},{"$f":"R$3*12-SUM($P6:Q6)-SUMPRODUCT(--(ABS($B6:$M6)<=R$3),R$3-ABS($B6:$M6))","v":108000},{"$f":"S$3*12-SUM($P6:R6)-SUMPRODUCT(--(ABS($B6:$M6)<=S$3),S$3-ABS($B6:$M6))","v":972122},null,{"$f":"(12*'Appendix F Pg 6'!$D$37)+(N6*(0.13441-0.00897))","v":140595.78367999999},0,140595.78367999999,null,{"$f":"(12*'Appendix F Pg 6'!$R$37)+(N6*'Appendix F Pg 6'!$R$39)","v":137188.36304},{"$f":"IF(N6<250000,(250000-N6)*'Appendix F Pg 6'!$R$39,0)","v":0},137188.36304]
["Idaho Forest Group LLC",80337,39562,64739,48981,21627,25348,165978,13501,53555,20768,23318,64757,622471,null,{"$f":"P$3*12-SUMPRODUCT(--(ABS($B7:$M7)<=P$3),P$3-ABS($B7:$M7))","v":2400},{"$f":"Q$3*12-P7-SUMPRODUCT(--(ABS($B7:$M7)<=Q$3),Q$3-ABS($B7:$M7))","v":9600},{"$f":"R$3*12-SUM($P7:Q7)-SUMPRODUCT(--(ABS($B7:$M7)<=R$3),R$3-ABS($B7:$M7))","v":108000},{"$f":"S$3*12-SUM($P7:R7)-SUMPRODUCT(--(ABS($B7:$M7)<=S$3),S$3-ABS($B7:$M7))","v":502471},null,{"$f":"(12*'Appendix F Pg 6'!$D$37)+(N7*(0.13441-0.00897))","v":81682.762239999996},0,81682.762239999996,null,{"$f":"(12*'Appendix F Pg 6'!$R$37)+(N7*'Appendix F Pg 6'!$R$39)","v":79740.652719999998},{"$f":"IF(N7<250000,(250000-N7)*'Appendix F Pg 6'!$R$39,0)","v":0},79740.652719999998]
["Kootenai Medical Center",79035,71378,64509,62279,57874,48069,43865,48977,48896,58948,63161,81609,728600,null,{"$f":"P$3*12-SUMPRODUCT(--(ABS($B8:$M8)<=P$3),P$3-ABS($B8:$M8))","v":2400},{"$f":"Q$3*12-P8-SUMPRODUCT(--(ABS($B8:$M8)<=Q$3),Q$3-ABS($B8:$M8))","v":9600},{"$f":"R$3*12-SUM($P8:Q8)-SUMPRODUCT(--(ABS($B8:$M8)<=R$3),R$3-ABS($B8:$M8))","v":108000},{"$f":"S$3*12-SUM($P8:R8)-SUMPRODUCT(--(ABS($B8:$M8)<=S$3),S$3-ABS($B8:$M8))","v":608600},null,{"$f":"(12*'Appendix F Pg 6'!$D$37)+(N8*(0.13441-0.00897))","v":94995.584000000003},0,94995.584000000003,null,{"$f":"(12*'Appendix F Pg 6'!$R$37)+(N8*'Appendix F Pg 6'!$R$39)","v":92722.351999999999},{"$f":"IF(N8<250000,(250000-N8)*'Appendix F Pg 6'!$R$39,0)","v":0},92722.351999999999]
["North Idaho Energy Logs ",63147,45946,56723,50517,29804,44348,40910,46987,39539,38450,51550,61111,569032,null,{"$f":"P$3*12-SUMPRODUCT(--(ABS($B9:$M9)<=P$3),P$3-ABS($B9:$M9))","v":2400},{"$f":"Q$3*12-P9-SUMPRODUCT(--(ABS($B9:$M9)<=Q$3),Q$3-ABS($B9:$M9))","v":9600},{"$f":"R$3*12-SUM($P9:Q9)-SUMPRODUCT(--(ABS($B9:$M9)<=R$3),R$3-ABS($B9:$M9))","v":108000},{"$f":"S$3*12-SUM($P9:R9)-SUMPRODUCT(--(ABS($B9:$M9)<=S$3),S$3-ABS($B9:$M9))","v":449032},null,{"$f":"(12*'Appendix F Pg 6'!$D$37)+(N9*(0.13441-0.00897))","v":74979.374079999994},0,74979.374079999994,null,{"$f":"(12*'Appendix F Pg 6'!$R$37)+(N9*'Appendix F Pg 6'!$R$39)","v":73203.99424},{"$f":"IF(N9<250000,(250000-N9)*'Appendix F Pg 6'!$R$39,0)","v":0},73203.99424]
["Univ of Idaho",38141,11693,5797,4891,83847,57639,963,626,43249,69274,115872,25384,457376,null,{"$f":"P$3*12-SUMPRODUCT(--(ABS($B10:$M10)<=P$3),P$3-ABS($B10:$M10))","v":2400},{"$f":"Q$3*12-P10-SUMPRODUCT(--(ABS($B10:$M10)<=Q$3),Q$3-ABS($B10:$M10))","v":9189},{"$f":"R$3*12-SUM($P10:Q10)-SUMPRODUCT(--(ABS($B10:$M10)<=R$3),R$3-ABS($B10:$M10))","v":80688},{"$f":"S$3*12-SUM($P10:R10)-SUMPRODUCT(--(ABS($B10:$M10)<=S$3),S$3-ABS($B10:$M10))","v":365099},null,{"$f":"(12*'Appendix F Pg 6'!$D$37)+(N10*(0.13441-0.00897))","v":60973.245439999999},0,60973.245439999999,null,{"$f":"(12*'Appendix F Pg 6'!$R$37)+(N10*'Appendix F Pg 6'!$R$39)","v":59546.232320000003},{"$f":"IF(N10<250000,(250000-N10)*'Appendix F Pg 6'!$R$39,0)","v":0},59546.232320000003]
{"$rows_left_out":57}
{"sheet":"Rev Runs CY","index":11,"n_rows":70,"n_cols":18,"rows_kept":70,"cut":false,"hidden":false,"merged":[[6,16,7,16]]}
[]
["Weather Norm Sch/Class Rev 12 ME Report for 12ME 06.2022"]
[null,null,"Meters"]
[null,"Period","202201","202202","202203","202204","202205","202206","202107","202108","202109","202110","202111","202112","12 Month Average"]
["Rate Schedule Num",null,null,null,null,null,null,null,null,null,null,null,null,null,"Average","Total","Check to Bill Determ Tab"]
["101",101,86698,88299,96640,90163,90894,91039,88760,88922,89176,89465,89735,89898,{"$f":"AVERAGE(C6:N6)","v":89974.083333333328},{"$f":"SUM(C6:N6)","v":1079689},{"$f":"P6-'Bill Determ'!C8","v":0}]
["111",111,1440,1497,1759,1547,1565,1570,1552,1571,1547,1552,1548,1555,{"$f":"AVERAGE(C7:N7)","v":1558.5833333333333},{"$f":"SUM(C7:N7)","v":18703},{"$f":"P7+P8-'Bill Determ'!G12","v":0}]
["112",112,2,2,2,2,2,2,2,2,2,2,2,2,2,24]
["132",132,null,null,null,null,null,null,null,null,null,null,null,null,null,0,{"$f":"P9-'Bill Determ'!C25","v":0}]
["146",146,6,6,6,6,6,6,6,6,6,6,6,6,6,72,{"$f":"P10-'Bill Determ'!C29","v":0}]
{"$rows_left_out":61}
{"sheet":"Block Analysis","index":12,"n_rows":31,"n_cols":17,"rows_kept":31,"cut":false,"hidden":false,"merged":[]}
[]
[]
[]
[]
[null,null,null,202201,{"$f":"D5+1","v":202202},{"$f":"E5+1","v":202203},202204,202205,202206,202107,202108,202109,202110,202111,202112,"YTD"]
["0111","BASIC CHARGE GAS",null,0,0,0,0,0,0,0,0,0,0,0,0,{"$f":"SUM(D6:O6)","v":0}]
[null,"NA",null,0,0,0,0,0,0,0,0,0,0,0,0,0]
[null,"RIDER 150",null,-88,0,0,0,0,0,0,0,-239,0,-16,0,-343]
[null,"RIDER 155",null,0,0,0,0,0,0,0,0,0,0,0,0,0]
[null,"RIDER 191",null,0,0,0,0,0,0,0,0,0,0,0,0,0]
{"$rows_left_out":21}